Target
Complement C1s subcomponent
Ligand
BDBM32791
Substrate
Meas. Tech.
Complement factor C1s IC50 from mixture screen
IC50
14910±1190 nM
Citation
 PubChem, PC Complement factor C1s IC50 from mixture screen PubChem Bioassay (2008)[AID] 
Target
Name:
Complement C1s subcomponent
Synonyms:
C1 esterase C1S_HUMAN Complement C1s subcomponent Complement C1s subcomponent light chain Trypsin | complement component 1, s subcomponent
Type:
Protein
Mol. Mass.:
76657.91
Organism:
Homo sapiens (Human)
Description:
P09871
Residue:
688
  
Inhibitor
Name:
BDBM32791
Synonyms:
1-(1-benzothien-3-ylcarbonyl)-1H-pyrazole 1-benzothiophen-3-yl(pyrazol-1-yl)methanone SMR000080341 cid_841465
Type:
Small organic molecule
Emp. Form.:
C12H8N2OS
Mol. Mass.:
228.27
SMILES:
O=C(c1csc2ccccc12)n1cccn1
: