Target
Complement C1s subcomponent
Ligand
BDBM33575
Substrate
Meas. Tech.
Complement factor C1s IC50 from mixture screen
IC50
15630±2790 nM
Citation
 PubChem, PC Complement factor C1s IC50 from mixture screen PubChem Bioassay (2008)[AID] 
Target
Name:
Complement C1s subcomponent
Synonyms:
C1 esterase C1S_HUMAN Complement C1s subcomponent Complement C1s subcomponent light chain Trypsin | complement component 1, s subcomponent
Type:
Protein
Mol. Mass.:
76657.91
Organism:
Homo sapiens (Human)
Description:
P09871
Residue:
688
  
Inhibitor
Name:
BDBM33575
Synonyms:
1-(2-furoyl)-3-(4-methoxyphenyl)-5-(methylthio)-1H-1,2,4-triazole 2-furyl-[3-(4-methoxyphenyl)-5-(methylthio)-1,2,4-triazol-1-yl]methanone SMR000075338 furan-2-yl-[3-(4-methoxyphenyl)-5-methylsulfanyl-1,2,4-triazol-1-yl]methanone
Type:
Small organic molecule
Emp. Form.:
C15H13N3O3S
Mol. Mass.:
315.347
SMILES:
COc1ccc(cc1)-c1nc(SC)n(n1)C(=O)c1ccco1
: