Target
Complement C1s subcomponent
Ligand
BDBM40895
Substrate
Meas. Tech.
Complement factor C1s IC50 from mixture screen
IC50
>50000±0 nM
Citation
 PubChem, PC Complement factor C1s IC50 from mixture screen PubChem Bioassay (2008)[AID] 
Target
Name:
Complement C1s subcomponent
Synonyms:
C1 esterase C1S_HUMAN Complement C1s subcomponent Complement C1s subcomponent light chain Trypsin | complement component 1, s subcomponent
Type:
Protein
Mol. Mass.:
76657.91
Organism:
Homo sapiens (Human)
Description:
P09871
Residue:
688
  
Inhibitor
Name:
BDBM40895
Synonyms:
3-(1-o-anisyl-2-piperidyl)pyridine 3-[1-[(2-methoxyphenyl)methyl]-2-piperidinyl]pyridine MLS000061635 cid_2857305
Type:
Small organic molecule
Emp. Form.:
C18H22N2O
Mol. Mass.:
282.3801
SMILES:
COc1ccccc1CN1CCCCC1c1cccnc1
: