Target
Complement C1s subcomponent
Ligand
BDBM40904
Substrate
Meas. Tech.
Complement factor C1s IC50 from mixture screen
IC50
>50000±0 nM
Citation
 PubChem, PC Complement factor C1s IC50 from mixture screen PubChem Bioassay (2008)[AID] 
Target
Name:
Complement C1s subcomponent
Synonyms:
C1 esterase C1S_HUMAN Complement C1s subcomponent Complement C1s subcomponent light chain Trypsin | complement component 1, s subcomponent
Type:
Protein
Mol. Mass.:
76657.91
Organism:
Homo sapiens (Human)
Description:
P09871
Residue:
688
  
Inhibitor
Name:
BDBM40904
Synonyms:
(3-bromanyl-4-methoxy-phenyl)-(3-methylpyrazol-1-yl)methanone (3-bromo-4-methoxyphenyl)-(3-methyl-1-pyrazolyl)methanone 1-(3-bromo-4-methoxybenzoyl)-3-methyl-1H-pyrazole SMR000074342 | cid_899202
Type:
Small organic molecule
Emp. Form.:
C12H11BrN2O2
Mol. Mass.:
295.132
SMILES:
COc1ccc(cc1Br)C(=O)n1ccc(C)n1
: