Target
Complement C1s subcomponent
Ligand
BDBM50077014
Substrate
Meas. Tech.
Complement factor C1s IC50 from mixture screen
IC50
4620±530 nM
Citation
 PubChem, PC Complement factor C1s IC50 from mixture screen PubChem Bioassay (2008)[AID] 
Target
Name:
Complement C1s subcomponent
Synonyms:
C1 esterase C1S_HUMAN Complement C1s subcomponent Complement C1s subcomponent light chain Trypsin | complement component 1, s subcomponent
Type:
Protein
Mol. Mass.:
76657.91
Organism:
Homo sapiens (Human)
Description:
P09871
Residue:
688
  
Inhibitor
Name:
BDBM50077014
Synonyms:
2-Furan-2-yl-benzo[d][1,3]oxazin-4-one cid_296003
Type:
Small organic molecule
Emp. Form.:
C12H7NO3
Mol. Mass.:
213.1889
SMILES:
O=c1oc(nc2ccccc12)-c1ccco1
: