Target
Complement C1s subcomponent
Ligand
BDBM37597
Substrate
Meas. Tech.
Complement factor C1s IC50 from mixture screen
IC50
>50000±0 nM
Citation
 PubChem, PC Complement factor C1s IC50 from mixture screen PubChem Bioassay (2008)[AID] 
Target
Name:
Complement C1s subcomponent
Synonyms:
C1 esterase C1S_HUMAN Complement C1s subcomponent Complement C1s subcomponent light chain Trypsin | complement component 1, s subcomponent
Type:
Protein
Mol. Mass.:
76657.91
Organism:
Homo sapiens (Human)
Description:
P09871
Residue:
688
  
Inhibitor
Name:
BDBM37597
Synonyms:
4-chloranyl-3-piperidin-1-ylsulfonyl-N-(1,3-thiazol-2-yl)benzamide 4-chloro-3-piperidin-1-ylsulfonyl-N-(1,3-thiazol-2-yl)benzamide MLS000109185 cid_1101757
Type:
Small organic molecule
Emp. Form.:
C15H16ClN3O3S2
Mol. Mass.:
385.889
SMILES:
Clc1ccc(cc1S(=O)(=O)N1CCCCC1)C(=O)Nc1nccs1
: