Target
Cathepsin B
Ligand
BDBM35491
Substrate
Meas. Tech.
Cathepsin B dose-response confirmation
IC50
9562.6±579.7 nM
Citation
 PubChem, PC Cathepsin B dose-response confirmation PubChem Bioassay (2008)[AID] 
Target
Name:
Cathepsin B
Synonyms:
APP secretase CATB_HUMAN CTSB Cathepsin B light chain | Cathepsin B1
Type:
Enzyme
Mol. Mass.:
37819.69
Organism:
Homo sapiens (Human)
Description:
gi_63102437
Residue:
339
  
Inhibitor
Name:
BDBM35491
Synonyms:
Benzoic acid 5-amino-1-(4-methoxy-benzenesulfonyl)-1H-pyrazol-3-yl ester SMR000014915 [5-azanyl-1-(4-methoxyphenyl)sulfonyl-pyrazol-3-yl] benzoate benzoic acid [5-amino-1-(4-methoxyphenyl)sulfonyl-pyrazol-3-yl] ester | cid_655490
Type:
Small organic molecule
Emp. Form.:
C17H15N3O5S
Mol. Mass.:
373.383
SMILES:
COc1ccc(cc1)S(=O)(=O)n1nc(OC(=O)c2ccccc2)cc1N
: