Target
Cathepsin B
Ligand
BDBM41110
Substrate
Meas. Tech.
Cathepsin B dose-response confirmation
IC50
>50000±0 nM
Citation
 PubChem, PC Cathepsin B dose-response confirmation PubChem Bioassay (2008)[AID] 
Target
Name:
Cathepsin B
Synonyms:
APP secretase CATB_HUMAN CTSB Cathepsin B light chain | Cathepsin B1
Type:
Enzyme
Mol. Mass.:
37819.69
Organism:
Homo sapiens (Human)
Description:
gi_63102437
Residue:
339
  
Inhibitor
Name:
BDBM41110
Synonyms:
MLS000084822 N'-(6-methoxy-1,3-benzothiazol-2-yl)-N,N-dimethyl-formamidine N'-(6-methoxy-1,3-benzothiazol-2-yl)-N,N-dimethylmethanimidamide cid_380199
Type:
Small organic molecule
Emp. Form.:
C11H13N3OS
Mol. Mass.:
235.305
SMILES:
COc1ccc2nc(N=CN(C)C)sc2c1
: