Target
Procathepsin L
Ligand
BDBM41151
Substrate
Meas. Tech.
Cathepsin L dose-response confirmation
IC50
5863.41±500.031 nM
Citation
 PubChem, PC Cathepsin L dose-response confirmation PubChem Bioassay (2008)[AID] 
Target
Name:
Procathepsin L
Synonyms:
CATL1_HUMAN CTSL CTSL1 Cathepsin L Cathepsin L1 heavy chain MEP cathepsin L preproprotein
Type:
Enzyme
Mol. Mass.:
37557.19
Organism:
Homo sapiens (Human)
Description:
Purchased from Calbiochem (San Diego, CA).
Residue:
333
  
Inhibitor
Name:
BDBM41151
Synonyms:
MLS000055134 N-[[5-(2-bromophenyl)-1,3,4-oxadiazol-2-yl]methyl]-2-fluoro-N-(2-furanylmethyl)benzenesulfonamide N-[[5-(2-bromophenyl)-1,3,4-oxadiazol-2-yl]methyl]-2-fluoro-N-(furan-2-ylmethyl)benzenesulfonamide cid_2110790
Type:
Small organic molecule
Emp. Form.:
C20H15BrFN3O4S
Mol. Mass.:
492.318
SMILES:
Fc1ccccc1S(=O)(=O)N(Cc1ccco1)Cc1nnc(o1)-c1ccccc1Br
: