Target
Procathepsin L
Ligand
BDBM41169
Substrate
Meas. Tech.
Cathepsin L dose-response confirmation
IC50
545.137±306.941 nM
Citation
 PubChem, PC Cathepsin L dose-response confirmation PubChem Bioassay (2008)[AID] 
Target
Name:
Procathepsin L
Synonyms:
CATL1_HUMAN CTSL CTSL1 Cathepsin L Cathepsin L1 heavy chain MEP cathepsin L preproprotein
Type:
Enzyme
Mol. Mass.:
37557.19
Organism:
Homo sapiens (Human)
Description:
Purchased from Calbiochem (San Diego, CA).
Residue:
333
  
Inhibitor
Name:
BDBM41169
Synonyms:
MLS000096134 N-[2-(azepan-1-yl)ethyl]-3-(tosylamino)propionamide N~1~-(2-azepan-1-ylethyl)-N~3~-[(4-methylphenyl)sulfonyl]-beta-alaninamide cid_3245560
Type:
Small organic molecule
Emp. Form.:
C18H29N3O3S
Mol. Mass.:
367.506
SMILES:
Cc1ccc(cc1)S(=O)(=O)NCCC(=O)NCCN1CCCCCC1
: