Target
DNA-directed RNA polymerase subunit beta
Ligand
BDBM41202
Substrate
Meas. Tech.
RNA polymerase dose-response confirmation
IC50
>50000±0 nM
Citation
 PubChem, PC RNA polymerase dose-response confirmation PubChem Bioassay (2008)[AID] 
Target
Name:
DNA-directed RNA polymerase subunit beta
Synonyms:
RNA polymerase beta subunit (EC 2.7.7.6)
Type:
Enzyme Catalytic Domain
Mol. Mass.:
150595.80
Organism:
Escherichia coli
Description:
A0A0E2LB94
Residue:
1342
  
Inhibitor
Name:
BDBM41202
Synonyms:
MLS000030899 N-(2-furfuryl)-2-[[4-(4-methoxyphenyl)-5-[(3-methylphenoxy)methyl]-1,2,4-triazol-3-yl]thio]acetamide N-(furan-2-ylmethyl)-2-[[4-(4-methoxyphenyl)-5-[(3-methylphenoxy)methyl]-1,2,4-triazol-3-yl]sulfanyl]ethanamide SMR000001824 | cid_653224
Type:
Small organic molecule
Emp. Form.:
C24H24N4O4S
Mol. Mass.:
464.537
SMILES:
COc1ccc(cc1)-n1c(COc2cccc(C)c2)nnc1SCC(=O)NCc1ccco1
: