Target
DNA-directed RNA polymerase subunit beta
Ligand
BDBM50318688
Substrate
Meas. Tech.
RNA polymerase dose-response confirmation
IC50
>50000±0 nM
Citation
 PubChem, PC RNA polymerase dose-response confirmation PubChem Bioassay (2008)[AID] 
Target
Name:
DNA-directed RNA polymerase subunit beta
Synonyms:
RNA polymerase beta subunit (EC 2.7.7.6)
Type:
Enzyme Catalytic Domain
Mol. Mass.:
150595.80
Organism:
Escherichia coli
Description:
A0A0E2LB94
Residue:
1342
  
Inhibitor
Name:
BDBM50318688
Synonyms:
3-N-Morpholinocarbamate-4-morpholino-1,2,5-thiadiazole cid_655946
Type:
Small organic molecule
Emp. Form.:
C11H16N4O4S
Mol. Mass.:
300.334
SMILES:
O=C(Oc1nsnc1N1CCOCC1)N1CCOCC1
: