Target
DNA-directed RNA polymerase subunit beta
Ligand
BDBM32020
Substrate
Meas. Tech.
RNA polymerase dose-response confirmation
IC50
12436.2±1092.89 nM
Citation
 PubChem, PC RNA polymerase dose-response confirmation PubChem Bioassay (2008)[AID] 
Target
Name:
DNA-directed RNA polymerase subunit beta
Synonyms:
RNA polymerase beta subunit (EC 2.7.7.6)
Type:
Enzyme Catalytic Domain
Mol. Mass.:
150595.80
Organism:
Escherichia coli
Description:
A0A0E2LB94
Residue:
1342
  
Inhibitor
Name:
BDBM32020
Synonyms:
4-[4-(3,4-dihydroxyphenyl)-2,3-dimethyl-butyl]pyrocatechol 4-[4-[3,4-bis(oxidanyl)phenyl]-2,3-dimethyl-butyl]benzene-1,2-diol CHEMBL52 MLS000069451 Nordihydroguaiaretic acid (NDGA) US10857082, Compound 2.18 | cid_4534
Type:
Small organic molecule
Emp. Form.:
C18H22O4
Mol. Mass.:
302.3649
SMILES:
CC(Cc1ccc(O)c(O)c1)C(C)Cc1ccc(O)c(O)c1
: