Target
DNA-directed RNA polymerase subunit beta
Ligand
BDBM41219
Substrate
Meas. Tech.
RNA polymerase dose-response confirmation
IC50
>50000±0 nM
Citation
 PubChem, PC RNA polymerase dose-response confirmation PubChem Bioassay (2008)[AID] 
Target
Name:
DNA-directed RNA polymerase subunit beta
Synonyms:
RNA polymerase beta subunit (EC 2.7.7.6)
Type:
Enzyme Catalytic Domain
Mol. Mass.:
150595.80
Organism:
Escherichia coli
Description:
A0A0E2LB94
Residue:
1342
  
Inhibitor
Name:
BDBM41219
Synonyms:
2-benzamido-N-(3-imidazol-1-ylpropyl)benzamide MLS000077681 cid_662097
Type:
Small organic molecule
Emp. Form.:
C20H20N4O2
Mol. Mass.:
348.3984
SMILES:
O=C(Nc1ccccc1C(=O)NCCCn1ccnc1)c1ccccc1
: