Target
DNA-directed RNA polymerase subunit beta
Ligand
BDBM41270
Substrate
Meas. Tech.
RNA polymerase dose-response confirmation
IC50
43792.4±0 nM
Citation
 PubChem, PC RNA polymerase dose-response confirmation PubChem Bioassay (2008)[AID] 
Target
Name:
DNA-directed RNA polymerase subunit beta
Synonyms:
RNA polymerase beta subunit (EC 2.7.7.6)
Type:
Enzyme Catalytic Domain
Mol. Mass.:
150595.80
Organism:
Escherichia coli
Description:
A0A0E2LB94
Residue:
1342
  
Inhibitor
Name:
BDBM41270
Synonyms:
MLS000111394 N-(3-chloro-4-hydroxy-2,5-dimethyl-phenyl)benzenesulfonamide SMR000107318 | cid_747934
Type:
Small organic molecule
Emp. Form.:
C14H14ClNO3S
Mol. Mass.:
311.784
SMILES:
Cc1cc(NS(=O)(=O)c2ccccc2)c(C)c(Cl)c1O
: