Target
DNA-directed RNA polymerase subunit beta
Ligand
BDBM41274
Substrate
Meas. Tech.
RNA polymerase dose-response confirmation
IC50
>50000±0 nM
Citation
 PubChem, PC RNA polymerase dose-response confirmation PubChem Bioassay (2008)[AID] 
Target
Name:
DNA-directed RNA polymerase subunit beta
Synonyms:
RNA polymerase beta subunit (EC 2.7.7.6)
Type:
Enzyme Catalytic Domain
Mol. Mass.:
150595.80
Organism:
Escherichia coli
Description:
A0A0E2LB94
Residue:
1342
  
Inhibitor
Name:
BDBM41274
Synonyms:
3-methylbutyl 4-acetamidobenzoate 4-acetamidobenzoic acid isoamyl ester SMR000102420 | cid_700602
Type:
Small organic molecule
Emp. Form.:
C14H19NO3
Mol. Mass.:
249.3056
SMILES:
CC(C)CCOC(=O)c1ccc(NC(C)=O)cc1
: