Target
DNA-directed RNA polymerase subunit beta
Ligand
BDBM41276
Substrate
Meas. Tech.
RNA polymerase dose-response confirmation
IC50
>50000±0 nM
Citation
 PubChem, PC RNA polymerase dose-response confirmation PubChem Bioassay (2008)[AID] 
Target
Name:
DNA-directed RNA polymerase subunit beta
Synonyms:
RNA polymerase beta subunit (EC 2.7.7.6)
Type:
Enzyme Catalytic Domain
Mol. Mass.:
150595.80
Organism:
Escherichia coli
Description:
A0A0E2LB94
Residue:
1342
  
Inhibitor
Name:
BDBM41276
Synonyms:
(6E)-6-[(5-ethyl-2-hydroxy-anilino)methylene]cyclohexa-2,4-dien-1-one (6E)-6-[(5-ethyl-2-hydroxyanilino)methylidene]cyclohexa-2,4-dien-1-one MLS000106894 cid_5339634
Type:
Small organic molecule
Emp. Form.:
C15H15NO2
Mol. Mass.:
241.2851
SMILES:
CCc1ccc(O)c(c1)N=Cc1ccccc1O
: