Target
Complement C1s subcomponent
Ligand
BDBM32794
Substrate
Meas. Tech.
Complement C1s ELISA
IC50
>50000±n/a nM
Citation
 PubChem, PC Complement C1s ELISA PubChem Bioassay (2008)[AID] 
Target
Name:
Complement C1s subcomponent
Synonyms:
C1 esterase C1S_HUMAN Complement C1s subcomponent Complement C1s subcomponent light chain Trypsin | complement component 1, s subcomponent
Type:
Protein
Mol. Mass.:
76657.91
Organism:
Homo sapiens (Human)
Description:
P09871
Residue:
688
  
Inhibitor
Name:
BDBM32794
Synonyms:
1-benzoyl-3,6,6-trimethyl-1,5,6,7-tetrahydro-4H-indazol-4-one 3,6,6-trimethyl-1-(phenylcarbonyl)-5,7-dihydroindazol-4-one SMR000069174 | cid_749826
Type:
Small organic molecule
Emp. Form.:
C17H18N2O2
Mol. Mass.:
282.337
SMILES:
Cc1nn(C(=O)c2ccccc2)c2CC(C)(C)CC(=O)c12
: