Target
Cathepsin S
Ligand
BDBM41288
Substrate
Meas. Tech.
Cathepsin S dose-response confirmation
IC50
>50000±0 nM
Citation
 PubChem, PC Cathepsin S dose-response confirmation PubChem Bioassay (2008)[AID] 
Target
Name:
Cathepsin S
Synonyms:
CATS_HUMAN Cathepsin S (Cat S) | cathepsin S preproprotein
Type:
Protein
Mol. Mass.:
37507.38
Organism:
Homo sapiens (Human)
Description:
P25774
Residue:
331
  
Inhibitor
Name:
BDBM41288
Synonyms:
MLS000029260 N-(2-hydroxy-4,5-dimethyl-phenyl)-2-(3-methylphenoxy)acetamide N-(4,5-dimethyl-2-oxidanyl-phenyl)-2-(3-methylphenoxy)ethanamide cid_652031
Type:
Small organic molecule
Emp. Form.:
C17H19NO3
Mol. Mass.:
285.3377
SMILES:
Cc1cccc(OCC(=O)Nc2cc(C)c(C)cc2O)c1
: