Target
Cathepsin S
Ligand
BDBM41315
Substrate
Meas. Tech.
Cathepsin S dose-response confirmation
IC50
>50000±0 nM
Citation
 PubChem, PC Cathepsin S dose-response confirmation PubChem Bioassay (2008)[AID] 
Target
Name:
Cathepsin S
Synonyms:
CATS_HUMAN Cathepsin S (Cat S) | cathepsin S preproprotein
Type:
Protein
Mol. Mass.:
37507.38
Organism:
Homo sapiens (Human)
Description:
P25774
Residue:
331
  
Inhibitor
Name:
BDBM41315
Synonyms:
2-(7,8-dihydro-6H-cyclopenta[2,3]thieno[2,4-d]pyrimidin-1-ylsulfanyl)acetonitrile 2-(7,8-dihydro-6H-cyclopenta[2,3]thieno[2,4-d]pyrimidin-1-ylthio)acetonitrile SMR000068762 | cid_2999160
Type:
Small organic molecule
Emp. Form.:
C11H9N3S2
Mol. Mass.:
247.339
SMILES:
N#CCSc1ncnc2sc3CCCc3c12
: