Target
Cathepsin S
Ligand
BDBM35520
Substrate
Meas. Tech.
Cathepsin S dose-response confirmation
IC50
3615.18±255.356 nM
Citation
 PubChem, PC Cathepsin S dose-response confirmation PubChem Bioassay (2008)[AID] 
Target
Name:
Cathepsin S
Synonyms:
CATS_HUMAN Cathepsin S (Cat S) | cathepsin S preproprotein
Type:
Protein
Mol. Mass.:
37507.38
Organism:
Homo sapiens (Human)
Description:
P25774
Residue:
331
  
Inhibitor
Name:
BDBM35520
Synonyms:
4-(4-morpholinyl)-6-(1-piperidinyl)-1,3,5-triazine-2-carbonitrile 4-morpholino-6-piperidino-s-triazine-2-carbonitrile SMR000081092 | cid_729563
Type:
Small organic molecule
Emp. Form.:
C13H18N6O
Mol. Mass.:
274.3216
SMILES:
N#Cc1nc(nc(n1)N1CCOCC1)N1CCCCC1
: