Target
Cathepsin G
Ligand
BDBM41380
Substrate
Meas. Tech.
Cathepsin G dose-response confirmation
IC50
>50000±0 nM
Citation
 PubChem, PC Cathepsin G dose-response confirmation PubChem Bioassay (2008)[AID] 
Target
Name:
Cathepsin G
Synonyms:
CATG_HUMAN CTSG
Type:
PROTEIN
Mol. Mass.:
28860.08
Organism:
Homo sapiens (Human)
Description:
ChEMBL_1469016
Residue:
255
  
Inhibitor
Name:
BDBM41380
Synonyms:
5-Methyl-pyrazine-2-carboxylic acid [2-(5-methyl-furan-2-yl)-phenyl]-amide 5-methyl-N-[2-(5-methyl-2-furyl)phenyl]pyrazinamide MLS000076172 cid_645091
Type:
Small organic molecule
Emp. Form.:
C17H15N3O2
Mol. Mass.:
293.3199
SMILES:
Cc1ccc(o1)-c1ccccc1NC(=O)c1cnc(C)cn1
: