Target
Cathepsin G
Ligand
BDBM41386
Substrate
Meas. Tech.
Cathepsin G dose-response confirmation
IC50
>50000±0 nM
Citation
 PubChem, PC Cathepsin G dose-response confirmation PubChem Bioassay (2008)[AID] 
Target
Name:
Cathepsin G
Synonyms:
CATG_HUMAN CTSG
Type:
PROTEIN
Mol. Mass.:
28860.08
Organism:
Homo sapiens (Human)
Description:
ChEMBL_1469016
Residue:
255
  
Inhibitor
Name:
BDBM41386
Synonyms:
5-cyano-4-(2-methoxyphenyl)-2-methyl-6-(2-oxidanylidene-2-pyrrolidin-1-yl-ethyl)sulfanyl-pyridine-3-carboxamide 5-cyano-4-(2-methoxyphenyl)-2-methyl-6-[[2-oxo-2-(1-pyrrolidinyl)ethyl]thio]-3-pyridinecarboxamide MLS000098127 cid_2998610
Type:
Small organic molecule
Emp. Form.:
C21H22N4O3S
Mol. Mass.:
410.489
SMILES:
COc1ccccc1-c1c(C#N)c(SCC(=O)N2CCCC2)nc(C)c1C(N)=O
: