Target
Ephrin type-B receptor 4
Ligand
BDBM41430
Substrate
Meas. Tech.
Dose-response biochemical assay for antagonists of the interaction between the Eph receptor B4 (EphB4) and its ligand ephrin-B2 via TNYL-RAW peptide
IC50
>79400±n/a nM
Citation
 PubChem, PC Dose-response biochemical assay for antagonists of the interaction between the Eph receptor B4 (EphB4) and its ligand ephrin-B2 via TNYL-RAW peptide PubChem Bioassay (2007)[AID] 
Target
Name:
Ephrin type-B receptor 4
Synonyms:
EPHB4 Ephrin receptor HTK MYK1 Tyrosine-protein kinase TYRO11 | VHL/Ephrin type-B receptor 4
Type:
Enzyme
Mol. Mass.:
108273.51
Organism:
Homo sapiens (Human)
Description:
P54760
Residue:
987
  
Inhibitor
Name:
BDBM41430
Synonyms:
3-Methyl-7-(3-methyl-butyl)-8-(2-morpholin-4-yl-ethylsulfanyl)-3,7-dihydro-purine-2,6-dione 3-methyl-7-(3-methylbutyl)-8-[2-(4-morpholinyl)ethylthio]purine-2,6-dione MLS000032294 cid_648814
Type:
Small organic molecule
Emp. Form.:
C17H27N5O3S
Mol. Mass.:
381.493
SMILES:
CC(C)CCn1c(SCCN2CCOCC2)nc2n(C)c(=O)[nH]c(=O)c12
: