Target
Ephrin type-B receptor 4
Ligand
BDBM41440
Substrate
Meas. Tech.
Dose-response biochemical assay for antagonists of the interaction between the Eph receptor B4 (EphB4) and its ligand ephrin-B2 via TNYL-RAW peptide
IC50
>79400±n/a nM
Citation
 PubChem, PC Dose-response biochemical assay for antagonists of the interaction between the Eph receptor B4 (EphB4) and its ligand ephrin-B2 via TNYL-RAW peptide PubChem Bioassay (2007)[AID] 
Target
Name:
Ephrin type-B receptor 4
Synonyms:
EPHB4 Ephrin receptor HTK MYK1 Tyrosine-protein kinase TYRO11 | VHL/Ephrin type-B receptor 4
Type:
Enzyme
Mol. Mass.:
108273.51
Organism:
Homo sapiens (Human)
Description:
P54760
Residue:
987
  
Inhibitor
Name:
BDBM41440
Synonyms:
2-cyano-2-[3-(4-methyl-1-piperazinyl)-2-quinoxalinyl]acetic acid hexyl ester MLS000041538 cid_662451 hexyl 2-cyano-2-[3-(4-methylpiperazin-1-yl)quinoxalin-2-yl]ethanoate
Type:
Small organic molecule
Emp. Form.:
C22H29N5O2
Mol. Mass.:
395.498
SMILES:
CCCCCCOC(=O)C(C#N)c1nc2ccccc2nc1N1CCN(C)CC1
: