Target
Ephrin type-B receptor 4
Ligand
BDBM32076
Substrate
Meas. Tech.
Dose-response biochemical assay for antagonists of the interaction between the Eph receptor B4 (EphB4) and its ligand ephrin-B2 via TNYL-RAW peptide
IC50
>79400±n/a nM
Citation
 PubChem, PC Dose-response biochemical assay for antagonists of the interaction between the Eph receptor B4 (EphB4) and its ligand ephrin-B2 via TNYL-RAW peptide PubChem Bioassay (2007)[AID] 
Target
Name:
Ephrin type-B receptor 4
Synonyms:
EPHB4 Ephrin receptor HTK MYK1 Tyrosine-protein kinase TYRO11 | VHL/Ephrin type-B receptor 4
Type:
Enzyme
Mol. Mass.:
108273.51
Organism:
Homo sapiens (Human)
Description:
P54760
Residue:
987
  
Inhibitor
Name:
BDBM32076
Synonyms:
1-ethyl-2-[(1-methylimidazol-2-yl)sulfanylmethyl]benzimidazole-5-carboxylic acid 1-ethyl-2-[[(1-methylimidazol-2-yl)thio]methyl]benzimidazole-5-carboxylic acid SMR000066468 | cid_2999671
Type:
Small organic molecule
Emp. Form.:
C15H16N4O2S
Mol. Mass.:
316.378
SMILES:
CCn1c(CSc2nccn2C)nc2cc(ccc12)C(O)=O
: