Target
Ephrin type-B receptor 4
Ligand
BDBM38656
Substrate
Meas. Tech.
Dose-response biochemical assay for antagonists of the interaction between the Eph receptor B4 (EphB4) and its ligand ephrin-B2 via TNYL-RAW peptide
IC50
>79400±n/a nM
Citation
 PubChem, PC Dose-response biochemical assay for antagonists of the interaction between the Eph receptor B4 (EphB4) and its ligand ephrin-B2 via TNYL-RAW peptide PubChem Bioassay (2007)[AID] 
Target
Name:
Ephrin type-B receptor 4
Synonyms:
EPHB4 Ephrin receptor HTK MYK1 Tyrosine-protein kinase TYRO11 | VHL/Ephrin type-B receptor 4
Type:
Enzyme
Mol. Mass.:
108273.51
Organism:
Homo sapiens (Human)
Description:
P54760
Residue:
987
  
Inhibitor
Name:
BDBM38656
Synonyms:
6-amino-4-[3-(1-benzotriazolylmethyl)-4-methoxyphenyl]-3-propyl-2,4-dihydropyrano[2,3-c]pyrazole-5-carbonitrile 6-amino-4-[3-(benzotriazol-1-ylmethyl)-4-methoxy-phenyl]-3-propyl-2,4-dihydropyrano[2,3-c]pyrazole-5-carbonitrile 6-azanyl-4-[3-(benzotriazol-1-ylmethyl)-4-methoxy-phenyl]-3-propyl-2,4-dihydropyrano[2,3-c]pyrazole-5-carbonitrile SMR000074878 | cid_2948028
Type:
Small organic molecule
Emp. Form.:
C24H23N7O2
Mol. Mass.:
441.4851
SMILES:
CCCc1[nH]nc2OC(=N)C(C#N)C(c12)c1ccc(OC)c(Cn2nnc3ccccc23)c1
: