Target
Ephrin type-B receptor 4
Ligand
BDBM40712
Substrate
Meas. Tech.
Dose-response biochemical assay for antagonists of the interaction between the Eph receptor B4 (EphB4) and its ligand ephrin-B2 via TNYL-RAW peptide
IC50
17800±n/a nM
Citation
 PubChem, PC Dose-response biochemical assay for antagonists of the interaction between the Eph receptor B4 (EphB4) and its ligand ephrin-B2 via TNYL-RAW peptide PubChem Bioassay (2007)[AID] 
Target
Name:
Ephrin type-B receptor 4
Synonyms:
EPHB4 Ephrin receptor HTK MYK1 Tyrosine-protein kinase TYRO11 | VHL/Ephrin type-B receptor 4
Type:
Enzyme
Mol. Mass.:
108273.51
Organism:
Homo sapiens (Human)
Description:
P54760
Residue:
987
  
Inhibitor
Name:
BDBM40712
Synonyms:
4-chloranyl-N-[(2-oxidanylideneacenaphthylen-1-ylidene)amino]benzamide 4-chloro-N-[(2-oxo-1-acenaphthylenylidene)amino]benzamide MLS000571167 cid_2487130
Type:
Small organic molecule
Emp. Form.:
C19H11ClN2O2
Mol. Mass.:
334.756
SMILES:
Clc1ccc(cc1)C(=O)NN=c1c2cccc3cccc(c23)c1=O
: