Target
Ephrin type-B receptor 4
Ligand
BDBM41515
Substrate
Meas. Tech.
Dose-response biochemical assay for antagonists of the interaction between the Eph receptor B4 (EphB4) and its ligand ephrin-B2 via TNYL-RAW peptide
IC50
>79400±n/a nM
Citation
 PubChem, PC Dose-response biochemical assay for antagonists of the interaction between the Eph receptor B4 (EphB4) and its ligand ephrin-B2 via TNYL-RAW peptide PubChem Bioassay (2007)[AID] 
Target
Name:
Ephrin type-B receptor 4
Synonyms:
EPHB4 Ephrin receptor HTK MYK1 Tyrosine-protein kinase TYRO11 | VHL/Ephrin type-B receptor 4
Type:
Enzyme
Mol. Mass.:
108273.51
Organism:
Homo sapiens (Human)
Description:
P54760
Residue:
987
  
Inhibitor
Name:
BDBM41515
Synonyms:
(5E)-3-methyl-5-(3-pyridinylmethylidene)thiazolidine-2,4-dione (5E)-3-methyl-5-(pyridin-3-ylmethylidene)-1,3-thiazolidine-2,4-dione MLS000547383 cid_5523891
Type:
Small organic molecule
Emp. Form.:
C10H8N2O2S
Mol. Mass.:
220.248
SMILES:
CN1C(=O)S\C(=C\c2cccnc2)C1=O
: