Target
Ephrin type-B receptor 4
Ligand
BDBM41524
Substrate
Meas. Tech.
Dose-response biochemical assay for antagonists of the interaction between the Eph receptor B4 (EphB4) and its ligand ephrin-B2 via TNYL-RAW peptide
IC50
>79400±n/a nM
Citation
 PubChem, PC Dose-response biochemical assay for antagonists of the interaction between the Eph receptor B4 (EphB4) and its ligand ephrin-B2 via TNYL-RAW peptide PubChem Bioassay (2007)[AID] 
Target
Name:
Ephrin type-B receptor 4
Synonyms:
EPHB4 Ephrin receptor HTK MYK1 Tyrosine-protein kinase TYRO11 | VHL/Ephrin type-B receptor 4
Type:
Enzyme
Mol. Mass.:
108273.51
Organism:
Homo sapiens (Human)
Description:
P54760
Residue:
987
  
Inhibitor
Name:
BDBM41524
Synonyms:
(E)-3-(2-furanyl)-2-[[1-naphthalenyl(oxo)methyl]amino]-2-propenoic acid (E)-3-(furan-2-yl)-2-(naphthalen-1-ylcarbonylamino)prop-2-enoic acid MLS000577109 cid_2186540
Type:
Small organic molecule
Emp. Form.:
C18H13NO4
Mol. Mass.:
307.3001
SMILES:
OC(=O)C(\NC(=O)c1cccc2ccccc12)=C/c1ccco1
: