Target
Sphingosine 1-phosphate receptor 2
Ligand
BDBM31045
Substrate
Meas. Tech.
Dose Response Cell Based Assay for Antagonists of the S1P2 Receptor
IC50
>50000±n/a nM
Citation
 PubChem, PC Dose Response Cell Based Assay for Antagonists of the S1P2 Receptor PubChem Bioassay (2007)[AID] 
Target
Name:
Sphingosine 1-phosphate receptor 2
Synonyms:
EDG5 S1PR2 Sphingosine 1-phosphate receptor Sphingosine-1-phosphate receptor 2 | ndothelial differentiation G-protein coupled receptor 5
Type:
G Protein-Coupled Receptor (GPCR)
Mol. Mass.:
38883.16
Organism:
Homo sapiens (Human)
Description:
Membranes isolated from S1P2-transfected CHO cells were used in ligand binding assay.
Residue:
353
  
Inhibitor
Name:
BDBM31045
Synonyms:
1-Ethyl-4-hydroxy-2-oxo-1,2-dihydro-quinoline-3-carboxylic acid (1H-benzoimidazol-2-yl)-amide N-(1H-benzimidazol-2-yl)-1-ethyl-2-hydroxy-4-keto-quinoline-3-carboxamide N-(1H-benzimidazol-2-yl)-1-ethyl-2-hydroxy-4-oxoquinoline-3-carboxamide N-(1H-benzimidazol-2-yl)-1-ethyl-4-hydroxy-2-keto-quinoline-3-carboxamide cid_654742
Type:
Small organic molecule
Emp. Form.:
C19H16N4O3
Mol. Mass.:
348.3553
SMILES:
CCn1c2ccccc2c(O)c(C(=O)Nc2nc3ccccc3[nH]2)c1=O
: