Target
Sphingosine 1-phosphate receptor 2
Ligand
BDBM36923
Substrate
Meas. Tech.
Dose Response Cell Based Assay for Antagonists of the S1P2 Receptor
IC50
3072±n/a nM
Citation
 PubChem, PC Dose Response Cell Based Assay for Antagonists of the S1P2 Receptor PubChem Bioassay (2007)[AID] 
Target
Name:
Sphingosine 1-phosphate receptor 2
Synonyms:
EDG5 S1PR2 Sphingosine 1-phosphate receptor Sphingosine-1-phosphate receptor 2 | ndothelial differentiation G-protein coupled receptor 5
Type:
G Protein-Coupled Receptor (GPCR)
Mol. Mass.:
38883.16
Organism:
Homo sapiens (Human)
Description:
Membranes isolated from S1P2-transfected CHO cells were used in ligand binding assay.
Residue:
353
  
Inhibitor
Name:
BDBM36923
Synonyms:
(Z)-3,4-bis(benzenesulfonyl)-2-buten-1-ol (Z)-3,4-bis(phenylsulfonyl)but-2-en-1-ol MLS000080860 cid_5389617
Type:
Small organic molecule
Emp. Form.:
C16H16O5S2
Mol. Mass.:
352.425
SMILES:
OC\C=C(\CS(=O)(=O)c1ccccc1)S(=O)(=O)c1ccccc1
: