Target
Sphingosine 1-phosphate receptor 2
Ligand
BDBM41592
Substrate
Meas. Tech.
Dose Response Cell Based Assay for Antagonists of the S1P2 Receptor
IC50
1759±n/a nM
Citation
 PubChem, PC Dose Response Cell Based Assay for Antagonists of the S1P2 Receptor PubChem Bioassay (2007)[AID] 
Target
Name:
Sphingosine 1-phosphate receptor 2
Synonyms:
EDG5 S1PR2 Sphingosine 1-phosphate receptor Sphingosine-1-phosphate receptor 2 | ndothelial differentiation G-protein coupled receptor 5
Type:
G Protein-Coupled Receptor (GPCR)
Mol. Mass.:
38883.16
Organism:
Homo sapiens (Human)
Description:
Membranes isolated from S1P2-transfected CHO cells were used in ligand binding assay.
Residue:
353
  
Inhibitor
Name:
BDBM41592
Synonyms:
(Z)-2,3-bis(chloranyl)-N-(6-methoxypyridin-3-yl)-3-(phenylmethyl)sulfonyl-prop-2-enamide (Z)-3-benzylsulfonyl-2,3-dichloro-N-(6-methoxy-3-pyridyl)acrylamide 3-(benzylsulfonyl)-2,3-dichloro-N-(6-methoxy-3-pyridinyl)acrylamide SMR000125561 | cid_1472218
Type:
Small organic molecule
Emp. Form.:
C16H14Cl2N2O4S
Mol. Mass.:
401.264
SMILES:
COc1ccc(NC(=O)C(\Cl)=C(\Cl)S(=O)(=O)Cc2ccccc2)cn1
: