Target
Sphingosine 1-phosphate receptor 2
Ligand
BDBM41628
Substrate
Meas. Tech.
Dose Response Cell Based Assay for Antagonists of the S1P2 Receptor
IC50
>30000±n/a nM
Citation
 PubChem, PC Dose Response Cell Based Assay for Antagonists of the S1P2 Receptor PubChem Bioassay (2007)[AID] 
Target
Name:
Sphingosine 1-phosphate receptor 2
Synonyms:
EDG5 S1PR2 Sphingosine 1-phosphate receptor Sphingosine-1-phosphate receptor 2 | ndothelial differentiation G-protein coupled receptor 5
Type:
G Protein-Coupled Receptor (GPCR)
Mol. Mass.:
38883.16
Organism:
Homo sapiens (Human)
Description:
Membranes isolated from S1P2-transfected CHO cells were used in ligand binding assay.
Residue:
353
  
Inhibitor
Name:
BDBM41628
Synonyms:
N-(4-fluorophenyl)-4-methyl-2-(2-thienyl)thiazole-5-carboxamide N-(4-fluorophenyl)-4-methyl-2-thiophen-2-yl-5-thiazolecarboxamide cid_7667820
Type:
Small organic molecule
Emp. Form.:
C15H11FN2OS2
Mol. Mass.:
318.389
SMILES:
Cc1nc(sc1C(=O)Nc1ccc(F)cc1)-c1cccs1
: