Target
P2X purinoceptor 3
Ligand
BDBM183252
Substrate
Meas. Tech.
Human P2X3 Receptor Inhibition Assay
pH
7.5±n/a
IC50
4.00±n/a nM
Comments
extracted
Citation
 Kai, HHoriguchi, TAsahi, KFujii, Y Triazine derivative and pharmaceutical composition having an analgesic activity comprising the same US Patent  US9718790 Publication Date 8/1/2017 
Target
Name:
P2X purinoceptor 3
Synonyms:
ATP receptor P2RX3 P2X purinoceptor 3 P2X purinoceptor 3 (P2X3) P2X3 purinoceptor p2x3 + hsa
Type:
Protein
Mol. Mass.:
44292.02
Organism:
Homo sapiens (Human)
Description:
P56373
Residue:
397
  
Inhibitor
Name:
BDBM183252
Synonyms:
US9150546, I-423 | US9718790, I-0422
Type:
Small organic molecule
Emp. Form.:
C26H28Cl2N4O5
Mol. Mass.:
547.43
SMILES:
CCOC(=O)C1(Cn2c(=O)[nH]\c(=N/c3ccc(OC(C)C)c(Cl)c3)n(Cc3ccc(Cl)cc3)c2=O)CC1
: