Target
P2X purinoceptor 3
Ligand
BDBM265675
Substrate
Meas. Tech.
Human P2X3 Receptor Inhibition Assay
pH
7.5±n/a
IC50
13.0±n/a nM
Comments
extracted
Citation
 Kai, HHoriguchi, TAsahi, KFujii, Y Triazine derivative and pharmaceutical composition having an analgesic activity comprising the same US Patent  US9718790 Publication Date 8/1/2017 
Target
Name:
P2X purinoceptor 3
Synonyms:
ATP receptor P2RX3 P2X purinoceptor 3 P2X purinoceptor 3 (P2X3) P2X3 purinoceptor p2x3 + hsa
Type:
Protein
Mol. Mass.:
44292.02
Organism:
Homo sapiens (Human)
Description:
P56373
Residue:
397
  
Inhibitor
Name:
BDBM265675
Synonyms:
US9718790, I-1963
Type:
Small organic molecule
Emp. Form.:
C22H18ClN5O6
Mol. Mass.:
483.861
SMILES:
CCn1c(=O)[nH]\c(=N/c2ccc(Oc3cc(on3)C(O)=O)cc2)n(Cc2ccc(Cl)cc2)c1=O
: