Target
Sphingosine 1-phosphate receptor 2
Ligand
BDBM41649
Substrate
Meas. Tech.
Dose Response Cell Based Assay for Agonists of the S1P2 Receptor
EC50
>50000±n/a nM
Citation
 PubChem, PC Dose Response Cell Based Assay for Agonists of the S1P2 Receptor PubChem Bioassay (2007)[AID] 
Target
Name:
Sphingosine 1-phosphate receptor 2
Synonyms:
EDG5 S1PR2 Sphingosine 1-phosphate receptor Sphingosine-1-phosphate receptor 2 | ndothelial differentiation G-protein coupled receptor 5
Type:
G Protein-Coupled Receptor (GPCR)
Mol. Mass.:
38883.16
Organism:
Homo sapiens (Human)
Description:
Membranes isolated from S1P2-transfected CHO cells were used in ligand binding assay.
Residue:
353
  
Inhibitor
Name:
BDBM41649
Synonyms:
2-[[1-(4-chlorophenyl)-1,2,3,4-tetrazol-5-yl]sulfanylmethyl]-5,7-dimethyl-imidazo[1,2-a]pyrimidine 2-[[[1-(4-chlorophenyl)-5-tetrazolyl]thio]methyl]-5,7-dimethylimidazo[1,2-a]pyrimidine MLS000048449 cid_2999642
Type:
Small organic molecule
Emp. Form.:
C16H14ClN7S
Mol. Mass.:
371.847
SMILES:
Cc1cc(C)n2cc(CSc3nnnn3-c3ccc(Cl)cc3)nc2n1
: