Target
Sphingosine 1-phosphate receptor 2
Ligand
BDBM41724
Substrate
Meas. Tech.
Dose Response Cell Based Assay for Agonists of the S1P2 Receptor of Purchased Analogues
EC50
>30000±n/a nM
Citation
 PubChem, PC Dose Response Cell Based Assay for Agonists of the S1P2 Receptor of Purchased Analogues PubChem Bioassay (2007)[AID] 
Target
Name:
Sphingosine 1-phosphate receptor 2
Synonyms:
EDG5 S1PR2 Sphingosine 1-phosphate receptor Sphingosine-1-phosphate receptor 2 | ndothelial differentiation G-protein coupled receptor 5
Type:
G Protein-Coupled Receptor (GPCR)
Mol. Mass.:
38883.16
Organism:
Homo sapiens (Human)
Description:
Membranes isolated from S1P2-transfected CHO cells were used in ligand binding assay.
Residue:
353
  
Inhibitor
Name:
BDBM41724
Synonyms:
2-(2,5-diketo-4,4-dimethyl-imidazolidin-1-yl)acetic acid [2-(1-benzyl-2,5-dimethyl-pyrrol-3-yl)-2-keto-ethyl] ester SR-01000759082-1 [2-[2,5-dimethyl-1-(phenylmethyl)pyrrol-3-yl]-2-oxidanylidene-ethyl] 2-[4,4-dimethyl-2,5-bis(oxidanylidene)imidazolidin-1-yl]ethanoate | cid_8026426
Type:
Small organic molecule
Emp. Form.:
C22H25N3O5
Mol. Mass.:
411.451
SMILES:
Cc1cc(C(=O)COC(=O)CN2C(=O)NC(C)(C)C2=O)c(C)n1Cc1ccccc1
: