Target
Sphingosine 1-phosphate receptor 2
Ligand
BDBM41744
Substrate
Meas. Tech.
Dose Response Cell Based Assay for Agonists of the S1P2 Receptor of Purchased Analogues
EC50
>30000±n/a nM
Citation
 PubChem, PC Dose Response Cell Based Assay for Agonists of the S1P2 Receptor of Purchased Analogues PubChem Bioassay (2007)[AID] 
Target
Name:
Sphingosine 1-phosphate receptor 2
Synonyms:
EDG5 S1PR2 Sphingosine 1-phosphate receptor Sphingosine-1-phosphate receptor 2 | ndothelial differentiation G-protein coupled receptor 5
Type:
G Protein-Coupled Receptor (GPCR)
Mol. Mass.:
38883.16
Organism:
Homo sapiens (Human)
Description:
Membranes isolated from S1P2-transfected CHO cells were used in ligand binding assay.
Residue:
353
  
Inhibitor
Name:
BDBM41744
Synonyms:
1-(1-benzyl-2,5-dimethyl-pyrrol-3-yl)-2-[4-(2-furoyl)piperazino]ethanone 1-[2,5-dimethyl-1-(phenylmethyl)-3-pyrrolyl]-2-[4-[2-furanyl(oxo)methyl]-1-piperazinyl]ethanone SR-01000759100-1 | cid_8548837
Type:
Small organic molecule
Emp. Form.:
C24H27N3O3
Mol. Mass.:
405.4895
SMILES:
Cc1cc(C(=O)CN2CCN(CC2)C(=O)c2ccco2)c(C)n1Cc1ccccc1
: