Target
Serine/threonine-protein kinase PLK1
Ligand
BDBM41755
Substrate
Meas. Tech.
Concentration Response Redox Cycling H2O2 Generation assay to characterize small molecule inhibitors identified in the Polo box domain (PBD) of Plk1 Primary HTS.
EC50
>50000±n/a nM
Citation
 PubChem, PC Concentration Response Redox Cycling H2O2 Generation assay to characterize small molecule inhibitors identified in the Polo box domain (PBD) of Plk1 Primary HTS. PubChem Bioassay (2007)[AID] 
Target
Name:
Serine/threonine-protein kinase PLK1
Synonyms:
PLK PLK1 Polo-like kinase 1 (PlK1) STPK13 Serine/threonine-protein kinase 13 | polo-like kinase
Type:
Serine/threonine-protein kinase
Mol. Mass.:
68277.16
Organism:
Homo sapiens (Human)
Description:
P53350
Residue:
603
  
Inhibitor
Name:
BDBM41755
Synonyms:
3-[(1-Cyclopentyl-1H-tetrazol-5-yl)-(4-phenyl-piperazin-1-yl)-methyl]-7-methyl-1H-quinolin-2-one 3-[(1-cyclopentyl-5-tetrazolyl)-(4-phenyl-1-piperazinyl)methyl]-7-methyl-1H-quinolin-2-one 3-[(1-cyclopentyltetrazol-5-yl)-(4-phenylpiperazino)methyl]-7-methyl-carbostyril SMR000002493 | cid_650853
Type:
Small organic molecule
Emp. Form.:
C27H31N7O
Mol. Mass.:
469.5813
SMILES:
Cc1ccc2cc(C(N3CCN(CC3)c3ccccc3)c3nnnn3C3CCCC3)c(=O)[nH]c2c1
: