Target
Serine/threonine-protein kinase PLK1
Ligand
BDBM37310
Substrate
Meas. Tech.
Concentration Response Redox Cycling H2O2 Generation assay to characterize small molecule inhibitors identified in the Polo box domain (PBD) of Plk1 Primary HTS.
EC50
>50000±n/a nM
Citation
 PubChem, PC Concentration Response Redox Cycling H2O2 Generation assay to characterize small molecule inhibitors identified in the Polo box domain (PBD) of Plk1 Primary HTS. PubChem Bioassay (2007)[AID] 
Target
Name:
Serine/threonine-protein kinase PLK1
Synonyms:
PLK PLK1 Polo-like kinase 1 (PlK1) STPK13 Serine/threonine-protein kinase 13 | polo-like kinase
Type:
Serine/threonine-protein kinase
Mol. Mass.:
68277.16
Organism:
Homo sapiens (Human)
Description:
P53350
Residue:
603
  
Inhibitor
Name:
BDBM37310
Synonyms:
1-(4-morpholinyl)-3-(propylthio)-5,6,7,8-tetrahydroisoquinoline-4-carbonitrile 1-morpholino-3-(propylthio)-5,6,7,8-tetrahydroisoquinoline-4-carbonitrile SMR000039075 | cid_658137
Type:
Small organic molecule
Emp. Form.:
C17H23N3OS
Mol. Mass.:
317.449
SMILES:
CCCSc1nc(N2CCOCC2)c2CCCCc2c1C#N
: