Target
Serine/threonine-protein kinase PLK1
Ligand
BDBM41781
Substrate
Meas. Tech.
Concentration Response Redox Cycling H2O2 Generation assay to characterize small molecule inhibitors identified in the Polo box domain (PBD) of Plk1 Primary HTS.
EC50
>50000±n/a nM
Citation
 PubChem, PC Concentration Response Redox Cycling H2O2 Generation assay to characterize small molecule inhibitors identified in the Polo box domain (PBD) of Plk1 Primary HTS. PubChem Bioassay (2007)[AID] 
Target
Name:
Serine/threonine-protein kinase PLK1
Synonyms:
PLK PLK1 Polo-like kinase 1 (PlK1) STPK13 Serine/threonine-protein kinase 13 | polo-like kinase
Type:
Serine/threonine-protein kinase
Mol. Mass.:
68277.16
Organism:
Homo sapiens (Human)
Description:
P53350
Residue:
603
  
Inhibitor
Name:
BDBM41781
Synonyms:
6-[4-(5-chloranyl-2-methyl-phenyl)piperazin-1-yl]sulfonyl-3-methyl-1,3-benzoxazol-2-one 6-[4-(5-chloro-2-methylphenyl)piperazin-1-yl]sulfonyl-3-methyl-1,3-benzoxazol-2-one 6-{[4-(5-chloro-2-methylphenyl)piperazin-1-yl]sulfonyl}-3-methyl-1,3-benzoxazol-2(3H)-one SMR000027426 | cid_2983872
Type:
Small organic molecule
Emp. Form.:
C19H20ClN3O4S
Mol. Mass.:
421.898
SMILES:
Cc1ccc(Cl)cc1N1CCN(CC1)S(=O)(=O)c1ccc2n(C)c(=O)oc2c1
: