Target
Serine/threonine-protein kinase PLK1
Ligand
BDBM41757
Substrate
Meas. Tech.
Concentration Response fluorescence polarization-based assay to confirm small molecule inhibitors identified in the Polo box domain (PBD) of Plk1 Primary HTS.
IC50
>50000±n/a nM
Citation
 PubChem, PC Concentration Response fluorescence polarization-based assay to confirm small molecule inhibitors identified in the Polo box domain (PBD) of Plk1 Primary HTS. PubChem Bioassay (2007)[AID] 
Target
Name:
Serine/threonine-protein kinase PLK1
Synonyms:
PLK PLK1 Polo-like kinase 1 (PlK1) STPK13 Serine/threonine-protein kinase 13 | polo-like kinase
Type:
Serine/threonine-protein kinase
Mol. Mass.:
68277.16
Organism:
Homo sapiens (Human)
Description:
P53350
Residue:
603
  
Inhibitor
Name:
BDBM41757
Synonyms:
Benzo[1,3]dioxole-5-carboxylic acid [4-(4-propionyl-piperazin-1-yl)-phenyl]-amide N-[4-(4-propanoylpiperazin-1-yl)phenyl]-1,3-benzodioxole-5-carboxamide N-[4-[4-(1-oxopropyl)-1-piperazinyl]phenyl]-1,3-benzodioxole-5-carboxamide cid_652011
Type:
Small organic molecule
Emp. Form.:
C21H23N3O4
Mol. Mass.:
381.425
SMILES:
CCC(=O)N1CCN(CC1)c1ccc(NC(=O)c2ccc3OCOc3c2)cc1
: