Target
Serine/threonine-protein kinase PLK1
Ligand
BDBM41779
Substrate
Meas. Tech.
Concentration Response fluorescence polarization-based assay to confirm small molecule inhibitors identified in the Polo box domain (PBD) of Plk1 Primary HTS.
IC50
>50000±n/a nM
Citation
 PubChem, PC Concentration Response fluorescence polarization-based assay to confirm small molecule inhibitors identified in the Polo box domain (PBD) of Plk1 Primary HTS. PubChem Bioassay (2007)[AID] 
Target
Name:
Serine/threonine-protein kinase PLK1
Synonyms:
PLK PLK1 Polo-like kinase 1 (PlK1) STPK13 Serine/threonine-protein kinase 13 | polo-like kinase
Type:
Serine/threonine-protein kinase
Mol. Mass.:
68277.16
Organism:
Homo sapiens (Human)
Description:
P53350
Residue:
603
  
Inhibitor
Name:
BDBM41779
Synonyms:
1-acetyl-5-bromo-N-(2-pyridinylmethyl)-2,3-dihydroindole-7-sulfonamide 1-acetyl-5-bromo-N-(pyridin-2-ylmethyl)-2,3-dihydroindole-7-sulfonamide 5-bromanyl-1-ethanoyl-N-(pyridin-2-ylmethyl)-2,3-dihydroindole-7-sulfonamide SMR000021766 | cid_3242806
Type:
Small organic molecule
Emp. Form.:
C16H16BrN3O3S
Mol. Mass.:
410.286
SMILES:
CC(=O)N1CCc2cc(Br)cc(c12)S(=O)(=O)NCc1ccccn1
: