Target
Serine/threonine-protein kinase PLK1
Ligand
BDBM41822
Substrate
Meas. Tech.
Concentration Response fluorescence polarization-based assay to confirm small molecule inhibitors identified in the Polo box domain (PBD) of Plk1 Primary HTS.
IC50
>50000±n/a nM
Citation
 PubChem, PC Concentration Response fluorescence polarization-based assay to confirm small molecule inhibitors identified in the Polo box domain (PBD) of Plk1 Primary HTS. PubChem Bioassay (2007)[AID] 
Target
Name:
Serine/threonine-protein kinase PLK1
Synonyms:
PLK PLK1 Polo-like kinase 1 (PlK1) STPK13 Serine/threonine-protein kinase 13 | polo-like kinase
Type:
Serine/threonine-protein kinase
Mol. Mass.:
68277.16
Organism:
Homo sapiens (Human)
Description:
P53350
Residue:
603
  
Inhibitor
Name:
BDBM41822
Synonyms:
1-(methylsulfonyl)-4-(3-phenyl-2-propen-1-yl)piperazine 1-methylsulfonyl-4-[(E)-3-phenylprop-2-enyl]piperazine SMR000135235 | cid_750930
Type:
Small organic molecule
Emp. Form.:
C14H20N2O2S
Mol. Mass.:
280.386
SMILES:
CS(=O)(=O)N1CCN(C\C=C\c2ccccc2)CC1
: