Target
Serine/threonine-protein kinase PLK1
Ligand
BDBM41825
Substrate
Meas. Tech.
Concentration Response fluorescence polarization-based assay to confirm small molecule inhibitors identified in the Polo box domain (PBD) of Plk1 Primary HTS.
IC50
>50000±n/a nM
Citation
 PubChem, PC Concentration Response fluorescence polarization-based assay to confirm small molecule inhibitors identified in the Polo box domain (PBD) of Plk1 Primary HTS. PubChem Bioassay (2007)[AID] 
Target
Name:
Serine/threonine-protein kinase PLK1
Synonyms:
PLK PLK1 Polo-like kinase 1 (PlK1) STPK13 Serine/threonine-protein kinase 13 | polo-like kinase
Type:
Serine/threonine-protein kinase
Mol. Mass.:
68277.16
Organism:
Homo sapiens (Human)
Description:
P53350
Residue:
603
  
Inhibitor
Name:
BDBM41825
Synonyms:
(4,5-dimethoxy-3-oxo-1,3-dihydro-2-benzofuran-1-yl)acetic acid 2-(4,5-dimethoxy-3-oxidanylidene-1H-2-benzofuran-1-yl)ethanoic acid 2-(4,5-dimethoxy-3-oxo-1H-isobenzofuran-1-yl)acetic acid SMR000135399 | cid_2863889
Type:
Small organic molecule
Emp. Form.:
C12H12O6
Mol. Mass.:
252.2201
SMILES:
COc1ccc2C(CC(O)=O)OC(=O)c2c1OC
: