Target
Beta-lactamase
Ligand
BDBM41848
Substrate
Meas. Tech.
Confirmation Cuvette-Based Assay for Inhibitors of AmpC Beta-Lactamase (assay with detergent)
Ki
17000±n/a nM
Citation
 PubChem, PC Confirmation Cuvette-Based Assay for Inhibitors of AmpC Beta-Lactamase (assay with detergent) PubChem Bioassay (2008)[AID] 
Target
Name:
Beta-lactamase
Synonyms:
AMPC_ECOLI Beta-lactamase (AmpC) Cephalosporinase ampA | ampC
Type:
Protien
Mol. Mass.:
41561.62
Organism:
Escherichia coli
Description:
P00811
Residue:
377
  
Inhibitor
Name:
BDBM41848
Synonyms:
2-[(1R)-1-carboxy-2-(1H-indol-3-yl)ethyl]-1,3-diketo-isoindoline-5-carboxylic acid 2-[(1R)-1-carboxy-2-(1H-indol-3-yl)ethyl]-1,3-dioxoisoindole-5-carboxylic acid NCGC00161787-01 | cid_16752637
Type:
Small organic molecule
Emp. Form.:
C20H14N2O6
Mol. Mass.:
378.335
SMILES:
OC(=O)[C@@H](Cc1c[nH]c2ccccc12)N1C(=O)c2ccc(cc2C1=O)C(O)=O
: