Target
Alkaline phosphatase, germ cell type
Ligand
BDBM50299525
Substrate
Meas. Tech.
Luminescent assay for identification of inhibitors of human intestinal alkaline phosphatase
IC50
>100000±n/a nM
Citation
 PubChem, PC Luminescent assay for identification of inhibitors of human intestinal alkaline phosphatase PubChem Bioassay (2009)[AID] 
Target
Name:
Alkaline phosphatase, germ cell type
Synonyms:
ALPG ALPPL2 PPBN_HUMAN | placental-like alkaline phosphatase preproprotein
Type:
PROTEIN
Mol. Mass.:
57374.31
Organism:
Homo sapiens (Human)
Description:
ChEMBL_29964
Residue:
532
  
Inhibitor
Name:
BDBM50299525
Synonyms:
5-chloro-2-methoxy-4-methyl-N-(pyridin-3-yl)benzenesulfonamide cid_6473097
Type:
Small organic molecule
Emp. Form.:
C13H13ClN2O3S
Mol. Mass.:
312.772
SMILES:
COc1cc(C)c(Cl)cc1S(=O)(=O)Nc1cccnc1
: