Target
Alkaline phosphatase, germ cell type
Ligand
BDBM41887
Substrate
Meas. Tech.
Luminescent assay for identification of inhibitors of human intestinal alkaline phosphatase
IC50
30200±n/a nM
Citation
 PubChem, PC Luminescent assay for identification of inhibitors of human intestinal alkaline phosphatase PubChem Bioassay (2009)[AID] 
Target
Name:
Alkaline phosphatase, germ cell type
Synonyms:
ALPG ALPPL2 PPBN_HUMAN | placental-like alkaline phosphatase preproprotein
Type:
PROTEIN
Mol. Mass.:
57374.31
Organism:
Homo sapiens (Human)
Description:
ChEMBL_29964
Residue:
532
  
Inhibitor
Name:
BDBM41887
Synonyms:
1-(3,4-dihydroxyphenyl)-2-(1-imidazolyl)ethanone;hydrochloride 1-(3,4-dihydroxyphenyl)-2-imidazol-1-ylethanone;hydrochloride CHEMBL349641 cid_25067472 | cid_52780
Type:
Small organic molecule
Emp. Form.:
C11H10N2O3
Mol. Mass.:
218.2087
SMILES:
Oc1ccc(cc1O)C(=O)Cn1ccnc1
: