Target
Alkaline phosphatase, germ cell type
Ligand
BDBM41890
Substrate
Meas. Tech.
Luminescent assay for identification of inhibitors of human intestinal alkaline phosphatase
IC50
14800±n/a nM
Citation
 PubChem, PC Luminescent assay for identification of inhibitors of human intestinal alkaline phosphatase PubChem Bioassay (2009)[AID] 
Target
Name:
Alkaline phosphatase, germ cell type
Synonyms:
ALPG ALPPL2 PPBN_HUMAN | placental-like alkaline phosphatase preproprotein
Type:
PROTEIN
Mol. Mass.:
57374.31
Organism:
Homo sapiens (Human)
Description:
ChEMBL_29964
Residue:
532
  
Inhibitor
Name:
BDBM41890
Synonyms:
2-(1-benzimidazolyl)-1-(3,4-dihydroxyphenyl)ethanone;hydrochloride 2-(benzimidazol-1-yl)-1-[3,4-bis(oxidanyl)phenyl]ethanone;hydrochloride MLS-0315853.0001 | cid_25067493
Type:
Small organic molecule
Emp. Form.:
C15H12N2O3
Mol. Mass.:
268.2674
SMILES:
Oc1ccc(cc1O)C(=O)Cn1cnc2ccccc12
: